{"text_format":"1","workbook":"xlsx","n_sheets":15,"sheets":["0.1 Introduction","0.2 FAQs","A1. Quick assessment & results","B1. Detailed assessment","B2. Result table, enviro impact","B3. Result table, nutrition","B4. Result summary and figures","C1. Enviro impact definitions","C2. Nutrition data","C3. Agricultural impact data","C4. Life cycle impact data","C5. Destination impact data","C6. Technical methods overview","C7. FAO FLW data","C8. List data"],"not_rendered":{"charts":18,"images":27,"macros":1,"external_links":1,"defined_names":83,"comments":2,"pivot_tables":0},"unopened":[],"bounds":{"document_bytes":16777216,"sheet_cells":100000,"rows_first":2000,"rows_last":500,"rows_between":2000,"halvings":0,"cell_chars":16384,"cell_head_chars":4096},"cells_cut":0,"cells_raw":0,"read":"whole","date_system":"1900"}

{"sheet":"0.1 Introduction","index":0,"n_rows":110,"n_cols":9,"rows_kept":110,"cut":false,"hidden":false,"merged":[[31,1,31,14],[33,1,33,14],[35,1,35,14],[75,1,75,14],[76,1,76,14],[70,1,70,14]]}
[]
[]
[]
[]
[]
[]
{"$rows_left_out":105}
{"sheet":"0.2 FAQs","index":1,"n_rows":29,"n_cols":9,"rows_kept":29,"cut":false,"hidden":false,"merged":[[30,2,31,6],[22,2,22,6],[28,2,28,6],[3,2,4,6],[7,2,8,6],[11,2,12,6],[15,2,16,6],[19,2,19,6],[25,2,25,6]]}
[null,"Frequently asked questions (FAQs)"]
[]
[null,"Q","What are the main uses of the calculator?"]
[null,"A","The calculator can be used to screen how efforts to prevent food loss and waste provide nutritional and environmental value. It can also be used to explore different scenarios, to see what the improvement could be if a certain amount is avoided, or to look at impacts related to FLW sent to different destinations. "]
[]
[]
{"$rows_left_out":24}
{"sheet":"A1. Quick assessment & results","index":2,"n_rows":103,"n_cols":17,"rows_kept":103,"cut":false,"hidden":false,"merged":[[22,2,22,17]]}
["Quick assessment and results: environmental impacts and nutritional profile"]
["ABOUT:","For this quick assessment, landfill is assumed to be the destination and up to 3 different scenarios can be compared."]
[null,"For more destinations and to screen more complex scenarios, go to tab \"B1. Detailed assessment\""]
[null,"Overview of steps to be performed in this tab:"]
[]
[]
{"$rows_left_out":98}
{"sheet":"B1. Detailed assessment","index":3,"n_rows":178,"n_cols":11,"rows_kept":178,"cut":false,"hidden":false,"merged":[[57,1,57,10],[58,3,58,10],[177,3,177,10],[22,4,28,10]]}
[null,"DATA ENTRY"]
[null,"Content on this page, click to go to:"]
[null,1,"Select food category"]
[null,2,"Select region"]
[null,3,"Enter FLW data"]
[null,4,"Select environmental impact"]
{"$rows_left_out":173}
{"sheet":"B2. Result table, enviro impact","index":4,"n_rows":128,"n_cols":10,"rows_kept":128,"cut":false,"hidden":false,"merged":[[3,9,4,18]]}
["Environmental impacts (no user input needed)"]
[null,"2. RESULTS TABLE (no action needed)"]
[null,null,null,null,null,null,null,null,null,"INTERPRETATION TIPS"]
[null,"2a. ",null,1,2,3,4,5,6,{"$f":"INDEX('C1. Enviro impact definitions'!D6:D8,MATCH(Impact,'C1. Enviro impact definitions'!C6:C8,0))","v":"The climate change impact indicates the carbon footprint of the FLW due to greenhouse gas emissions (GHGs). This accounts for the radiative forcing of various GHGs using the Global Warming Potential for 100 year time frame. "}]
[null,"Agricultural production",null,{"$f":"Food_cat1","v":"<click to select>"},{"$f":"Food_cat2","v":"<click to select>"},{"$f":"Food_cat3","v":"<click to select>"},{"$f":"Food_cat4","v":"<click to select>"},{"$f":"Food_cat5","v":"<click to select>"},{"$f":"Food_cat6","v":"<click to select>"}]
[null,null,null,{"$f":"Food_cat1_region","v":"<click to select>"},{"$f":"Food_cat2_region","v":"<click to select>"},{"$f":"Food_cat3_region","v":"<click to select>"},{"$f":"Food_cat4_region","v":"<click to select>"},{"$f":"Food_cat5_region","v":"<click to select>"},{"$f":"Food_cat6_region","v":"<click to select>"},"ONLY ANIMAL FEED AND BIO-BASED MATERIAL DESTINATIONS HAVE IMPACTS REPORTED, OTHER THAN CLIMATE CHANGE."]
{"$rows_left_out":123}
{"sheet":"B3. Result table, nutrition","index":5,"n_rows":66,"n_cols":27,"rows_kept":66,"cut":false,"hidden":false,"merged":[]}
["Nutritional results (no user input needed)"]
[null,"Nutrititional values and per-person daily requirements fulfilled (summed over full supply chain)"]
[null,null,null,{"$f":"Food_cat1","v":"<click to select>"},null,null,null,{"$f":"Food_cat2","v":"<click to select>"},null,null,null,{"$f":"Food_cat3","v":"<click to select>"},null,null,null,{"$f":"Food_cat4","v":"<click to select>"},null,null,null,{"$f":"Food_cat5","v":"<click to select>"},null,null,null,{"$f":"Food_cat6","v":"<click to select>"}]
[null,null,null,{"$f":"Cat1Tot","v":""},"tonnes",null,null,{"$f":"Cat2Tot","v":""},null,"tonnes",null,{"$f":"Cat3Tot","v":""},null,"tonnes",null,{"$f":"Cat4Tot","v":""},null,"tonnes",null,{"$f":"Cat5Tot","v":""},null,"tonnes",null,{"$f":"Cat6Tot","v":""},null,"tonnes"]
[null,null,null,"Amount (nutrition)",null,"Equivalent daily values (based on 2000 kcal diet from US FDA)",null,"Amount (nutrition)",null,"Equivalent daily values (based on 2000 kcal diet from US FDA)",null,"Amount (nutrition)",null,"Equivalent daily values (based on 2000 kcal diet from US FDA)",null,"Amount (nutrition)",null,"Equivalent daily values (based on 2000 kcal diet from US FDA)",null,"Amount (nutrition)",null,"Equivalent daily values (based on 2000 kcal diet from US FDA)",null,"Amount (nutrition)",null,"Equivalent daily values (based on 2000 kcal diet from US FDA)"]
[null,null,"Energy",{"$f":"(AgTotCat1+PostHarvTotCat1+ProcTotCat1+DistTotCat1+ConsTotCat1)*grams_tonne*INDEX('C2. Nutrition data'!$D$4:$AW$29,MATCH(D$3,'C2. Nutrition data'!$B$4:$B$29,0),MATCH($C6,'C2. Nutrition data'!$D$3:$AW$3,0))/grams100","v":{"$error":"#N/A"}},"(kcal)",{"$f":"D6/INDEX('C2. Nutrition data'!$D$32:$AW$32,MATCH($C6,'C2. Nutrition data'!$D$3:$AW$3,0))","v":{"$error":"#N/A"}},{"$f":"RANK(F6,F$6:F$32,1)+COUNTIF(F$6:F6,F6)-1","v":{"$error":"#N/A"}},{"$f":"(AgTotCat2+PostHarvTotCat2+ProcTotCat2+DistTotCat2+ConsTotCat2)*grams_tonne*INDEX('C2. Nutrition data'!$D$4:$AW$30,MATCH($H$3,'C2. Nutrition data'!$B$4:$B$30,0),MATCH('B3. Result table, nutrition'!$C6,'C2. Nutrition data'!$D$3:$AW$3,0))/grams100","v":{"$error":"#N/A"}},"(kcal)",{"$f":"H6/INDEX('C2. Nutrition data'!$D$32:$AW$32,MATCH($C6,'C2. Nutrition data'!$D$3:$AW$3,0))","v":{"$error":"#N/A"}},{"$f":"RANK(J6,J$6:J$32,1)+COUNTIF(J$6:J6,J6)-1","v":{"$error":"#N/A"}},{"$f":"(AgTotCat3+PostHarvTotCat3+ProcTotCat3+DistTotCat3+ConsTotCat3)*grams_tonne*INDEX('C2. Nutrition data'!$D$4:$AW$30,MATCH($L$3,'C2. Nutrition data'!$B$4:$B$30,0),MATCH('B3. Result table, nutrition'!$C6,'C2. Nutrition data'!$D$3:$AW$3,0))/grams100","v":{"$error":"#N/A"}},"(kcal)",{"$f":"L6/INDEX('C2. Nutrition data'!$D$32:$AW$32,MATCH($C6,'C2. Nutrition data'!$D$3:$AW$3,0))","v":{"$error":"#N/A"}},{"$f":"RANK(N6,N$6:N$32,1)+COUNTIF(N$6:N6,N6)-1","v":{"$error":"#N/A"}},{"$f":"(AgTotCat4+PostHarvTotCat4+ProcTotCat4+DistTotCat4+ConsTotCat4)*grams_tonne*INDEX('C2. Nutrition data'!$D$4:$AW$30,MATCH($P$3,'C2. Nutrition data'!$B$4:$B$30,0),MATCH('B3. Result table, nutrition'!$C6,'C2. Nutrition data'!$D$3:$AW$3,0))/grams100","v":{"$error":"#N/A"}},"(kcal)",{"$f":"P6/INDEX('C2. Nutrition data'!$D$32:$AW$32,MATCH($C6,'C2. Nutrition data'!$D$3:$AW$3,0))","v":{"$error":"#N/A"}},{"$f":"RANK(R6,R$6:R$32,1)+COUNTIF(R$6:R6,R6)-1","v":{"$error":"#N/A"}},{"$f":"(AgTotCat5+PostHarvTotCat5+ProcTotCat5+DistTotCat5+ConsTotCat5)*grams_tonne*INDEX('C2. Nutrition data'!$D$4:$AW$30,MATCH($T$3,'C2. Nutrition data'!$B$4:$B$30,0),MATCH('B3. Result table, nutrition'!$C6,'C2. Nutrition data'!$D$3:$AW$3,0))/grams100","v":{"$error":"#N/A"}},"(kcal)",{"$f":"T6/INDEX('C2. Nutrition data'!$D$32:$AW$32,MATCH($C6,'C2. Nutrition data'!$D$3:$AW$3,0))","v":{"$error":"#N/A"}},{"$f":"RANK(V6,V$6:V$32,1)+COUNTIF(V$6:V6,V6)-1","v":{"$error":"#N/A"}},{"$f":"(AgTotCat6+PostHarvTotCat6+ProcTotCat6+DistTotCat6+ConsTotCat6)*grams_tonne*INDEX('C2. Nutrition data'!$D$4:$AW$30,MATCH($X$3,'C2. Nutrition data'!$B$4:$B$30,0),MATCH('B3. Result table, nutrition'!$C6,'C2. Nutrition data'!$D$3:$AW$3,0))/grams100","v":{"$error":"#N/A"}},"(kcal)",{"$f":"X6/INDEX('C2. Nutrition data'!$D$32:$AW$32,MATCH($C6,'C2. Nutrition data'!$D$3:$AW$3,0))","v":{"$error":"#N/A"}},{"$f":"RANK(Z6,Z$6:Z$32,1)+COUNTIF(Z$6:Z6,Z6)-1","v":{"$error":"#N/A"}}]
{"$rows_left_out":61}
{"sheet":"B4. Result summary and figures","index":6,"n_rows":161,"n_cols":18,"rows_kept":161,"cut":false,"hidden":false,"merged":[[1,0,3,10]]}
["Results figures"]
["The results from the calculator can help communicate about the impacts of FLW. However, the results provided by this calculator are based on a set of assumptions that may differ from your situation, and the calculator results have not been peer-reviewed. This must be taken into account in any communication or decision making."]
[]
[]
[]
[]
{"$rows_left_out":156}
{"sheet":"C1. Enviro impact definitions","index":7,"n_rows":12,"n_cols":4,"rows_kept":12,"cut":false,"hidden":false,"merged":[[5,3,5,11],[6,3,6,11],[7,3,7,11],[8,3,8,11],[9,3,9,11]]}
[null,null,"Impact categories"]
[]
[]
[null,"Impact descriptions"]
[]
[null,null,"Climate change (kg CO2 eq)","The climate change impact indicates the carbon footprint of the FLW due to greenhouse gas emissions (GHGs). This accounts for the radiative forcing of various GHGs using the Global Warming Potential for 100 year time frame. "]
{"$rows_left_out":7}
{"sheet":"C2. Nutrition data","index":8,"n_rows":34,"n_cols":49,"rows_kept":34,"cut":false,"hidden":false,"merged":[]}
[null,null,null,"NUTRITION PER 100G"]
[null,null,"USDA name","Water_(g)","Energ_Kcal","Protein_(g)","Lipid_Tot_(g)","Ash_(g)","Carbohydrt_(g)","Fiber_TD_(g)","Sugar_Tot_(g)","Calcium_(mg)","Iron_(mg)","Magnesium_(mg)","Phosphorus_(mg)","Potassium_(mg)","Sodium_(mg)","Zinc_(mg)","Copper_mg)","Manganese_(mg)","Selenium_(µg)","Vit_C_(mg)","Thiamin_(mg)","Riboflavin_(mg)","Niacin_(mg)","Panto_Acid_mg)","Vit_B6_(mg)","Folate_Tot_(µg)","Folic_Acid_(µg)","Food_Folate_(µg)","Folate_DFE_(µg)","Choline_Tot_ (mg)","Vit_B12_(µg)","Vit_A_IU","Vit_A_RAE","Retinol_(µg)","Alpha_Carot_(µg)","Beta_Carot_(µg)","Beta_Crypt_(µg)","Lycopene_(µg)","Lut+Zea_ (µg)","Vit_E_(mg)","Vit_D_µg","Vit_D_IU","Vit_K_(µg)","FA_Sat_(g)","FA_Mono_(g)","FA_Poly_(g)","Cholestrl_(mg)"]
[null,"Food type","Calculator name",null,"Energy","Protein",null,null,"Carbohydrates","Fiber","sugar","Calcium","Iron","Magnesium","Phosphorus","Potassium","Sodium","Zinc","Copper","Manganese","Selenium","Vit C","Thiamin","Riboflavin","Niacin","Panto acid","Vit B6","Folate (total)","Folic acid","Food folate","Folate DFE","Choline","Vit B12","Vit A",null,"Retinol","Alpha carotene","Beta  carotene","Beta crypt.","Lycopene","Lut+Zea","Vit E","Vit D",null,"Vit K","FA Sat","FA Mono","FA Poly","Cholestrl"]
[null,"CEREAL",null,{"$f":"AVERAGE(D5:D7)","v":10.976666666666667},{"$f":"AVERAGE(E5:E7)","v":356.33333333333331},10.076666666666666,2.6233333333333335,1.2066666666666668,75.11333333333333,2.8666666666666667,0.25333333333333335,23,3.5133333333333332,98.666666666666671,277.66666666666669,277.66666666666669,14,2.4866666666666668,0.3623333333333334,1.5283333333333333,40,0,0.45999999999999996,0.12366666666666666,4.8523333333333332,0.79100000000000004,0.40166666666666667,97.666666666666671,74.333333333333329,23.333333333333332,149.66666666666666,1.9333333333333333,0,71.333333333333329,3.6666666666666665,0,21,32.333333333333336,0,0,451.66666666666669,0.19999999999999998,0,0,0.13333333333333333,0.43366666666666664,0.60033333333333327,1.1059999999999999,0]
[null,"maize","CORN GRAIN,YEL",10.37,365,9.42,4.74,1.2,74.260000000000005,7.3,0.64,7,2.71,127,210,287,35,2.21,0.314,0.48499999999999999,15.5,0,0.38500000000000001,0.20100000000000001,3.6269999999999998,0.42399999999999999,0.622,19,0,19,19,0,0,214,11,0,63,97,0,0,1355,0.49,0,0,0.3,0.66700000000000004,1.2509999999999999,2.1629999999999998,0]
[null,"rice","RICE,WHITE,LONG-GRAIN,REG,RAW,ENR",11.62,365,7.13,0.66,0.64,79.95,1.3,0.12,28,4.3099999999999996,25,115,115,5,1.0900000000000001,0.22,1.0880000000000001,15.1,0,0.57599999999999996,4.9000000000000002E-2,4.1920000000000002,1.014,0.16400000000000001,231,223,8,387,5.8,0,0,0,0,0,0,0,0,0,0.11,0,0,0.1,0.18,0.20599999999999999,0.17699999999999999,0]
{"$rows_left_out":29}
{"sheet":"C3. Agricultural impact data","index":9,"n_rows":213,"n_cols":12,"rows_kept":213,"cut":false,"hidden":false,"merged":[]}
["Agricultural impacts"]
["Impact categories (other than greenhouse gas emissions) are not available for users in this version. "]
[null,null,null,null,null,null,"Climate change (kg CO2 eq)","Eutrophication (kg P eq)","Eutrophication (kg N eq)","Land use (Points)","Water scarcity footprint (m3-eq)","<-NAMES USED FOR INDEXING TABLE"]
[null,"Impact data are from the World Food LCA database 3.3  from Quantis with ecoinvent 3 in the background."]
[null,"name",null,"region","name and region","data proxy","kg CO2-eq","kg P-eq","kg N-eq","Pt","m3-eq"]
[null,"CEREAL",null,"unknown",{"$f":"B6&\", \"&D6","v":"CEREAL, unknown"},"Global",{"$f":"AVERAGE(G7:G9)","v":1.13184884},{"$f":"AVERAGE(H7:H9)","v":3.8957680666666661E-4},8.8554038666666668E-3,244.47801899999999,12.668327033333334]
{"$rows_left_out":208}
{"sheet":"C4. Life cycle impact data","index":10,"n_rows":124,"n_cols":11,"rows_kept":124,"cut":false,"hidden":false,"merged":[]}
["Life Cycle Impacts (assumptions based on expert knowledge, can be improved beyond the Beta version)"]
[]
[]
[]
[]
[]
{"$rows_left_out":119}
{"sheet":"C5. Destination impact data","index":11,"n_rows":281,"n_cols":17,"rows_kept":281,"cut":false,"hidden":false,"merged":[]}
["Destination impacts (assumptions based on expert knowledge, can be improved beyond the Beta version)"]
["Table of values and assumptions used for destination impacts. These values are calculated based on a screening approach using expert judgement, further work would be required to improve these values."]
[null,null,null,null,null,null,null,null,null,null,null,"Climate change (kg CO2 eq)","Eutrophication (kg P eq)","Eutrophication (kg N eq)","Land use (Points)","Water scarcity footprint (m3-eq)","<-NAMES USED FOR INDEXING TABLE"]
["Food type","Destination","Combined name",null,"Replacement ratio for animal feed",null,null,"Assumption"]
["CEREAL","Animal feed",{"$f":"A5&\", \"&B5","v":"CEREAL, Animal feed"},null,{"$f":"INDEX('C2. Nutrition data'!$F$4:$F$29,MATCH(A5,'C2. Nutrition data'!$B$4:$B$29,0))/'C2. Nutrition data'!$F$24","v":0.27614871654334516},null,null,"impact offset (all categories): assumed replaces soybean (feed quality) for pig feed according to protein ratio (as proxy for amino acids) ; 20% loss assumed as an efficiency adjustment",null,null,null,{"$f":"-1*B$275*$E5*$A$280","v":-0.59966206329405314},{"$f":"-1*C$275*$E5*$A$280","v":-8.2616838394554068E-5},{"$f":"-1*D$275*$E5*$A$280","v":-2.3892166482038946E-3},{"$f":"-1*E$275*$E5*$A$280","v":-75.495669046250171},{"$f":"-1*$F$275*$E5*$A$280","v":-2.2471162179957978E-2},"<-don't drop down formula"]
["maize","Animal feed","maize, Animal feed",null,{"$f":"INDEX('C2. Nutrition data'!$F$4:$F$29,MATCH(A6,'C2. Nutrition data'!$B$4:$B$29,0))/'C2. Nutrition data'!$F$24","v":0.25815291860783773},null,null,"impact offset (all categories): assumed replaces soybean (feed quality) for pig feed according to protein ratio (as proxy for amino acids) ; 20% loss assumed as an efficiency adjustment",null,null,null,-0.56058385407508904,-7.7232942541518299E-5,-2.2335184412253409E-3,-70.575838810685738,{"$f":"-1*$F$275*$E6*$A$280","v":-2.1006782772266374E-2}]
{"$rows_left_out":276}
{"sheet":"C6. Technical methods overview","index":12,"n_rows":116,"n_cols":10,"rows_kept":116,"cut":false,"hidden":false,"merged":[[8,3,8,7],[115,1,115,8],[3,2,3,7],[39,2,39,7],[56,2,56,7],[57,2,57,7],[65,3,65,7],[66,3,66,7],[67,3,67,7],[69,3,69,7],[72,3,72,7],[75,2,75,8],[73,2,73,8],[5,2,5,7]]}
[]
[null,"Technical methods overview (environmental impacts and nutritional values)"]
[null,"Overview of methodology to calculate environmental impacts"]
[null,null,"The environmental impacts of food loss and waste is the sum of the impacts of the food's agricultural production, the intermediary accrued additional life cycle impacts between production and disposal (e.g. transports, storage, processing, and cooking, and referred to as life cycle impacts) and the impacts of the destination (e.g. landfill emissions and referred to as destination impacts)."]
[null,"Environmental impacts of agricultural production"]
[null,null,"The environmental impacts of production were obtained from the Quantis World Food LCA Database using ecoinvent in the background. Regional archetypes were selected when available also considering per-country production volume in that region, e.g. bananas coming from Ecuador (one of the largest banana producers) were used as a proxy for banana production in Latin America. Many times region-specific agricultural production data were lacking, and a global default value was used. Regional proxies are listed below in Table 1. Different production processes (e.g. organic agricultural) were not considered. The calculator does not account for losses across the supply chain when calculating the environmental impacts of production of various foods (that are not enterred by the user)."]
{"$rows_left_out":111}
{"sheet":"C7. FAO FLW data","index":13,"n_rows":45,"n_cols":8,"rows_kept":45,"cut":false,"hidden":false,"merged":[]}
["Data from: FAO Gustavsson et al. 2011 Global food losses and food waste – Extent, causes and prevention. Rome : http://www.fao.org/docrep/014/mb060e/mb060e.pdf"]
[null,null,null,"Waste by stage"]
["Waste Category","Region","Crop-Region","Agricultural production","Postharvest handling and storage","Processing and packaging","Distribution","Consumption"]
["Cereals","South and Southeast Asia","Cereals, South and Southeast Asia",6,7,3.5,2,3]
["Cereals","Europe incl Russia","Cereals, Europe incl Russia",2,4,10.5,2,25]
["Cereals","North Africa, West and Central Asia","Cereals, North Africa, West and Central Asia",6,8,9,4,12]
{"$rows_left_out":40}
{"sheet":"C8. List data","index":14,"n_rows":43,"n_cols":13,"rows_kept":43,"cut":false,"hidden":false,"merged":[]}
[null,null,"Food categories and regions"]
[]
[null,"Food category",null,null,"Region of production",null,"Life cycle stages",null,"Units",null,null,null,"Nutrients"]
[null,null,"<click to select>",null,"<click to select>",null,"<click to select>",null,1000,"kg/tonne",null,null,"Energy"]
[null,null,"CEREAL",null,"unknown",null,"Agricultural production",null,1000000,"g/tonne",null,null,"Protein"]
[null,null,"maize",null,"Europe and Russia",null,"Post-harvest handling and storage",null,100,"g ",null,null,"Carbohydrates"]
{"$rows_left_out":37}